{"text_format":"3","workbook":"xlsx","n_sheets":7,"sheets":["Main","Future Intra","Cash Intra","MidCap Intra","Bulk Deals","Call Tracker (Equity & F&O)","Sheet2"],"not_rendered":{"images":4,"defined_names":4},"read":"whole","date_system":"1900"}

{"sheet":"Main","index":0,"n_rows":17,"n_cols":4,"rows_kept":17}
[null,"                                                                                                 "]
{"$rows_empty":8}
[null,"2018-08-10"]
[]
[null,"Sheet No.","Template Name","Summary"]
[null,1,"Future Intra","For Intraday trading in F&O segment"]
[null,2,"Cash Intra","For Intraday trading in cash market segment"]
[null,3,"Mid-cap Intra","For Intraday trading in Mid-cap stocks"]
[null,4,"Bulk Deals","Reveals Bulk Deals carried on NSE & BSE"]
[null,5,"Call Tracker"]

{"sheet":"Future Intra","index":1,"n_rows":250,"n_cols":15,"rows_kept":250,"merged":[[8,0,9,0],[8,1,9,1],[8,2,9,2],[8,5,8,7],[8,8,8,10]]}
[]
[]
[]
[]
[{"$nulls":12},"Back to Main Page"]
["FOR INTRA DAY TRADING",{"$nulls":10},{"$f":"Main!B10","v":"2018-08-10"}]
[]
[]
["Sr.no","Sector","Scrip","CLOSE RATE","Pivot Point","Supports",null,null,"Resistances"]
[null,"Sector",null,"Point","Point","S1","S2","S3","R1","R2","R3","HIGH","LOW","OI","% Change in OI"]
[1,"Index","BANKNIFTY",{"v":28351.7,"d":"28351.70"},{"v":28305.18333333333,"d":"28305.18"},{"v":28224.36666666666,"d":"28224.37"},{"v":28097.03333333333,"d":"28097.03"},{"v":28016.21666666666,"d":"28016.22"},{"v":28432.516666666663,"d":"28432.52"},{"v":28513.333333333336,"d":"28513.33"},{"v":28640.666666666664,"d":"28640.67"},28386,28177.85,3020440,{"v":0.06993978037548707,"d":"6.99%"}]
[2,"Index","NIFTY",11487.55,{"v":11486.416666666666,"d":"11486.42"},{"v":11468.133333333331,"d":"11468.13"},{"v":11448.716666666665,"d":"11448.72"},{"v":11430.43333333333,"d":"11430.43"},{"v":11505.833333333332,"d":"11505.83"},{"v":11524.116666666669,"d":"11524.12"},{"v":11543.533333333333,"d":"11543.53"},11504.7,11467,29665125,{"v":0.023885086511281153,"d":"2.39%"}]
[3,"Index","NIFTYCPSE",2472.95,{"v":824.3166666666666,"d":"824.32"},{"v":1648.6333333333332,"d":"1648.63"},{"v":824.3166666666666,"d":"824.32"},{"v":1648.6333333333332,"d":"1648.63"},{"v":1648.6333333333332,"d":"1648.63"},{"v":824.3166666666666,"d":"824.32"},{"v":1648.6333333333332,"d":"1648.63"},0,0,0,{"v":0,"d":"0.00%"}]
[4,"Index","NIFTYINFRA",3400.05,{"v":1133.3500000000001,"d":"1133.35"},{"v":2266.7000000000003,"d":"2266.70"},{"v":1133.3500000000001,"d":"1133.35"},{"v":2266.7000000000003,"d":"2266.70"},{"v":2266.7000000000003,"d":"2266.70"},{"v":1133.3500000000001,"d":"1133.35"},{"v":2266.7000000000003,"d":"2266.70"},0,0,0,{"v":0,"d":"0.00%"}]
[5,"Index","NIFTYIT",{"v":14646,"d":"14646.00"},{"v":14656.333333333334,"d":"14656.33"},{"v":14622.666666666668,"d":"14622.67"},{"v":14599.333333333334,"d":"14599.33"},{"v":14565.666666666668,"d":"14565.67"},{"v":14679.666666666668,"d":"14679.67"},{"v":14713.333333333336,"d":"14713.33"},{"v":14736.666666666668,"d":"14736.67"},14690,14633,25150,{"v":-0.017578125,"d":"-1.76%"}]
[6,"Index","NIFTYMID50",{"v":5030,"d":"5030.00"},{"v":5030,"d":"5030.00"},{"v":5030,"d":"5030.00"},{"v":5030,"d":"5030.00"},{"v":5030,"d":"5030.00"},{"v":5030,"d":"5030.00"},{"v":5030,"d":"5030.00"},{"v":5030,"d":"5030.00"},5030,5030,592020,{"v":0,"d":"0.00%"}]
[7,"Index","NIFTYPSE",3925.45,{"v":1308.4833333333333,"d":"1308.48"},{"v":2616.9666666666667,"d":"2616.97"},{"v":1308.4833333333333,"d":"1308.48"},{"v":2616.9666666666667,"d":"2616.97"},{"v":2616.9666666666667,"d":"2616.97"},{"v":1308.4833333333333,"d":"1308.48"},{"v":2616.9666666666667,"d":"2616.97"},0,0,0,{"v":0,"d":"0.00%"}]
[8,"Cement","ACC",{"v":1579.7,"d":"1579.70"},{"v":1568.5333333333335,"d":"1568.53"},{"v":1553.166666666667,"d":"1553.17"},{"v":1526.6333333333334,"d":"1526.63"},{"v":1511.2666666666669,"d":"1511.27"},{"v":1595.066666666667,"d":"1595.07"},{"v":1610.4333333333334,"d":"1610.43"},{"v":1636.9666666666672,"d":"1636.97"},1583.9,1542,1931600,{"v":0.14268812115475626,"d":"14.27%"}]
[9,"Others","ADANIENT",200.95,{"v":202.33333333333334,"d":"202.33"},{"v":197.11666666666667,"d":"197.12"},{"v":193.28333333333333,"d":"193.28"},{"v":188.06666666666666,"d":"188.07"},{"v":206.16666666666669,"d":"206.17"},{"v":211.38333333333333,"d":"211.38"},{"v":215.2166666666667,"d":"215.22"},207.55,198.5,37740000,{"v":-0.02721930095886174,"d":"-2.72%"}]
[10,"Others","ADANIPORTS",{"v":379.8,"d":"379.80"},{"v":378.68333333333334,"d":"378.68"},{"v":374.8666666666667,"d":"374.87"},{"v":369.93333333333334,"d":"369.93"},{"v":366.1166666666667,"d":"366.12"},{"v":383.6166666666667,"d":"383.62"},{"v":387.4333333333334,"d":"387.43"},{"v":392.3666666666667,"d":"392.37"},382.5,373.75,11860000,{"v":-0.0420032310177706,"d":"-4.20%"}]
{"$rows_left_out":224}
{"sheet":"Cash Intra","index":2,"n_rows":248,"n_cols":13,"rows_kept":248,"merged":[[7,0,8,0],[7,1,8,1],[7,2,8,2],[7,3,8,3],[7,4,7,6],[7,7,7,9]]}
[]
[]
[]
[]
[{"$nulls":12},"Back to Main Page"]
["FOR INTRA DAY TRADING",{"$nulls":9},{"$f":"Main!B10","v":"2018-08-10"}]
[]
["Sr.no","Scrip","CLOSE RATE","Pivot Point","Supports",null,null,"Resistances"]
[null,null,"Point",null,"S1","S2","S3","R1","R2","R3","HIGH","LOW","Total Trade Quanity in Lakhs"]
[1,"Nifty 50",11470.7,{"v":11473.333333333334,"d":"11473.33"},{"v":11451.466666666667,"d":"11451.47"},{"v":11432.233333333334,"d":"11432.23"},{"v":11410.366666666667,"d":"11410.37"},{"v":11492.566666666668,"d":"11492.57"},{"v":11514.433333333332,"d":"11514.43"},{"v":11533.666666666668,"d":"11533.67"},11495.2,11454.1]
[2,"Nifty Bank",28320,{"v":28271.8,"d":"28271.80"},{"v":28180.199999999997,"d":"28180.20"},{"v":28040.399999999998,"d":"28040.40"},{"v":27948.799999999996,"d":"27948.80"},{"v":28411.6,"d":"28411.60"},{"v":28503.199999999997,"d":"28503.20"},{"v":28643,"d":"28643.00"},28363.4,28132]
[3,"Nifty CPSE",2372.7,{"v":2375.7000000000003,"d":"2375.70"},{"v":2361.6500000000005,"d":"2361.65"},{"v":2350.6000000000004,"d":"2350.60"},{"v":2336.5500000000006,"d":"2336.55"},{"v":2386.7500000000005,"d":"2386.75"},{"v":2400.8000000000006,"d":"2400.80"},{"v":2411.8500000000004,"d":"2411.85"},2389.75,2364.65]
[4,"Nifty Infra",3155.35,{"v":3157.7000000000003,"d":"3157.70"},{"v":3145.9000000000005,"d":"3145.90"},{"v":3136.4500000000003,"d":"3136.45"},{"v":3124.6500000000005,"d":"3124.65"},{"v":3167.1500000000005,"d":"3167.15"},{"v":3178.9500000000007,"d":"3178.95"},{"v":3188.4000000000005,"d":"3188.40"},3169.5,3148.25]
[5,"Nifty IT",14603.35,14618.25,14574.05,14544.75,14500.55,14647.55,14691.75,14721.05,14662.45,14588.95]
[6,"Nifty PSE",3692.75,{"v":3688.6999999999994,"d":"3688.70"},{"v":3672.7499999999986,"d":"3672.75"},{"v":3652.749999999999,"d":"3652.75"},{"v":3636.7999999999984,"d":"3636.80"},{"v":3708.699999999999,"d":"3708.70"},{"v":3724.6499999999996,"d":"3724.65"},{"v":3744.649999999999,"d":"3744.65"},3704.65,3668.7]
[7,"Nifty Midcap 50",5065.75,{"v":5059.716666666666,"d":"5059.72"},{"v":5042.533333333333,"d":"5042.53"},{"v":5019.316666666667,"d":"5019.32"},{"v":5002.133333333333,"d":"5002.13"},{"v":5082.9333333333325,"d":"5082.93"},{"v":5100.116666666665,"d":"5100.12"},{"v":5123.333333333332,"d":"5123.33"},5076.9,5036.5]
[8,"ABB",1200.3,{"v":1204.7333333333333,"d":"1204.73"},{"v":1187.5666666666666,"d":"1187.57"},{"v":1174.8333333333333,"d":"1174.83"},{"v":1157.6666666666665,"d":"1157.67"},{"v":1217.4666666666667,"d":"1217.47"},{"v":1234.6333333333332,"d":"1234.63"},{"v":1247.3666666666668,"d":"1247.37"},1221.9,1192,0.26813]
[9,"ACC",1570.75,1561.95,{"v":1546.9,"d":"1546.90"},1523.05,{"v":1508,"d":"1508.00"},{"v":1585.8000000000002,"d":"1585.80"},1600.85,{"v":1624.7000000000003,"d":"1624.70"},1577,1538.1,6.9143]
[10,"AIAENG",1758.55,{"v":1764.5166666666667,"d":"1764.52"},{"v":1729.0333333333333,"d":"1729.03"},{"v":1699.5166666666667,"d":"1699.52"},{"v":1664.0333333333333,"d":"1664.03"},{"v":1794.0333333333333,"d":"1794.03"},{"v":1829.5166666666664,"d":"1829.52"},{"v":1859.0333333333333,"d":"1859.03"},1800,1735,0.1293]
[11,"AUBANK",644.55,648.15,{"v":637.4,"d":"637.40"},630.25,{"v":619.5,"d":"619.50"},{"v":655.3,"d":"655.30"},666.05,{"v":673.1999999999999,"d":"673.20"},658.9,641,1.16074]
{"$rows_left_out":229}
{"sheet":"MidCap Intra","index":3,"n_rows":511,"n_cols":13,"rows_kept":511,"merged":[[0,0,0,1],[8,0,9,0],[8,1,9,1],[8,2,9,2],[8,3,9,3],[8,4,8,6],[8,7,8,9]]}
[]
[]
[]
[]
[{"$nulls":11},"Back To Main Page"]
["FOR INTRA DAY TRADING",{"$nulls":9},{"$f":"Main!B10","v":"2018-08-10"}]
[null,null," "]
[]
["Sr.no","Scrip","CLOSE RATE","Pivot Point","Supports",null,null,"Resistances"]
[null,null,"Point",null,"S1","S2","S3","R1","R2","R3","HIGH","LOW","Total Trade Quanity in Lakhs"]
[1,"3MINDIA",24147.8,{"v":24130.31666666667,"d":"24130.32"},{"v":23740.63333333334,"d":"23740.63"},{"v":23333.46666666667,"d":"23333.47"},{"v":22943.78333333334,"d":"22943.78"},{"v":24537.483333333337,"d":"24537.48"},{"v":24927.166666666664,"d":"24927.17"},{"v":25334.333333333336,"d":"25334.33"},24520,23723.15,0.08561]
[2,"8KMILES",372.5,{"v":376.84999999999997,"d":"376.85"},{"v":361.19999999999993,"d":"361.20"},{"v":349.9,"d":"349.90"},{"v":334.24999999999994,"d":"334.25"},{"v":388.1499999999999,"d":"388.15"},{"v":403.7999999999999,"d":"403.80"},{"v":415.0999999999999,"d":"415.10"},392.5,365.55,4.82264]
[3,"AARTIIND",1437.55,{"v":1425.8500000000001,"d":"1425.85"},{"v":1406.7000000000003,"d":"1406.70"},{"v":1375.8500000000001,"d":"1375.85"},{"v":1356.7000000000003,"d":"1356.70"},{"v":1456.7000000000003,"d":"1456.70"},{"v":1475.8500000000004,"d":"1475.85"},{"v":1506.7000000000003,"d":"1506.70"},1445,1395,0.93893]
[4,"ABAN",117.15,{"v":117.76666666666667,"d":"117.77"},{"v":115.68333333333334,"d":"115.68"},{"v":114.21666666666667,"d":"114.22"},{"v":112.13333333333334,"d":"112.13"},{"v":119.23333333333333,"d":"119.23"},{"v":121.31666666666668,"d":"121.32"},{"v":122.78333333333333,"d":"122.78"},119.85,116.3,8.92775]
[5,"ABB",1200.3,{"v":1204.7333333333333,"d":"1204.73"},{"v":1187.5666666666666,"d":"1187.57"},{"v":1174.8333333333333,"d":"1174.83"},{"v":1157.6666666666665,"d":"1157.67"},{"v":1217.4666666666667,"d":"1217.47"},{"v":1234.6333333333332,"d":"1234.63"},{"v":1247.3666666666668,"d":"1247.37"},1221.9,1192,0.26813]
[6,"ABCAPITAL",150.1,{"v":150.51666666666668,"d":"150.52"},{"v":148.63333333333335,"d":"148.63"},{"v":147.16666666666669,"d":"147.17"},{"v":145.28333333333336,"d":"145.28"},{"v":151.98333333333335,"d":"151.98"},{"v":153.86666666666667,"d":"153.87"},{"v":155.33333333333334,"d":"155.33"},152.4,149.05,17.79312]
[7,"ABFRL",181.9,{"v":180.33333333333334,"d":"180.33"},{"v":176.66666666666669,"d":"176.67"},{"v":171.43333333333334,"d":"171.43"},{"v":167.76666666666668,"d":"167.77"},{"v":185.5666666666667,"d":"185.57"},{"v":189.23333333333338,"d":"189.23"},{"v":194.4666666666667,"d":"194.47"},184,175.1,16.70435]
[8,"ACC",1570.75,1561.95,{"v":1546.9,"d":"1546.90"},1523.05,{"v":1508,"d":"1508.00"},{"v":1585.8000000000002,"d":"1585.80"},1600.85,{"v":1624.7000000000003,"d":"1624.70"},1577,1538.1,6.9143]
[9,"ADANIPORTS",378,{"v":376.84999999999997,"d":"376.85"},{"v":372.69999999999993,"d":"372.70"},{"v":367.4,"d":"367.40"},{"v":363.24999999999994,"d":"363.25"},{"v":382.1499999999999,"d":"382.15"},{"v":386.2999999999999,"d":"386.30"},{"v":391.5999999999999,"d":"391.60"},381,371.55,19.92284]
[10,"ADANIPOWER",32.4,{"v":32.583333333333336,"d":"32.58"},{"v":31.66666666666667,"d":"31.67"},{"v":30.933333333333337,"d":"30.93"},{"v":30.016666666666673,"d":"30.02"},{"v":33.31666666666667,"d":"33.32"},{"v":34.23333333333334,"d":"34.23"},{"v":34.96666666666667,"d":"34.97"},33.5,31.85,497.41068]
{"$rows_left_out":492}
{"sheet":"Bulk Deals","index":4,"n_rows":52,"n_cols":8,"rows_kept":52,"merged":[[4,0,4,1],[4,2,4,3],[6,1,6,2]]}
[" "]
[]
[]
[]
[]
[{"$nulls":4},"Back To Main Page"]
["Subject :","BULK DEAL",null,{"$f":"Main!B10","v":"2018-08-10"}]
[]
["Date","Scrip code","Scrip Name","Client Name","Buy / Sell","Quantity Traded","Trade Price / Wt.Avg.trade price","Exchange  "]
["2018-08-09",539770,"DARJEELING","KRUTI KEVIN KAPADIA","SELL",{"v":22876,"d":"22,876"},51.89,"BSE"]
["2018-08-09",523708,"EIMCOELECO","DHEERAJ KUMAR LOHIA","BUY",{"v":32164,"d":"32,164"},375.72,"BSE"]
["2018-08-09",503681,"ELCIDIN","DEVDA MANCKCHAND PRASANCHAND","SELL",{"v":4444,"d":"4,444"},5.89,"BSE"]
["2018-08-09",503681,"ELCIDIN","ALPA R SANGHRAJKA","BUY",{"v":4444,"d":"4,444"},5.89,"BSE"]
["2018-08-09",500170,"GTNINDS","DEVJYOT TRADE AND INVESTMENT PRIVATE LIMITED","SELL",{"v":137837,"d":"137,837"},18.26,"BSE"]
["2018-08-09",500170,"GTNINDS","DEVJYOT TRADE AND INVESTMENT PRIVATE LIMITED","BUY",{"v":137837,"d":"137,837"},16.28,"BSE"]
["2018-08-09",526263,"MOLDTEK","RAJESH GOENKA","BUY",{"v":175000,"d":"175,000"},43.75,"BSE"]
["2018-08-09",526263,"MOLDTEK","KRISHNI DEVI GOENKA","BUY",{"v":175000,"d":"175,000"},43.75,"BSE"]
["2018-08-09",526263,"MOLDTEK","AKG FINVEST LIMITED","SELL",{"v":409000,"d":"409,000"},43.75,"BSE"]
["2018-08-09",535205,"MYSTICELE","MAHESH KHANDELWAL (HUF) .","BUY",{"v":100000,"d":"100,000"},51.06,"BSE"]
["2018-08-09",530127,"NPRFIN","ANAND MISHRILAL JAJU","BUY",{"v":38112,"d":"38,112"},34.71,"BSE"]
{"$rows_left_out":33}
{"sheet":"Call Tracker (Equity & F&O)","index":5,"n_rows":290,"n_cols":18,"rows_kept":290,"merged":[[57,0,58,0],[57,1,58,1],[57,8,58,8],[57,9,58,9],[57,10,58,10],[57,11,58,11],[57,12,58,12],[57,13,58,13],[57,14,58,14]]}
[]
[]
[]
[]
[{"$nulls":12},"Back To Main Page"]
["Retail Research Technical Calls & Fundamental Performance Report for the month of August -2018 "]
[{"$nulls":12},{"$f":"Main!B10","v":"2018-08-10"}]
[null,"Positional  Call"]
["Sr.no","Date",null,"Company","Rec","Rec Price","Stop Loss***","Call Closed At","Target","Remark","Profit / Loss per Share","Gain / Loss  %","Status","Closed Date","NSE Closed Price"]
[1,"2018-07-17",null,"LUPIN","Buy",823.5,782,852,"890-910","Profit of Rs.28.50/-",{"$f":"H10-F10","v":{"v":28.5,"d":"28.50"}},{"$f":"K10/F10","v":{"v":0.03460837887067395,"d":"3.46%"}},"Successful","2018-08-02",{"$nulls":3},"R"]
[2,"2018-07-25",null,"TVSMOTOR","Buy",540.5,513,556.5,"590-600","Part Profit of Rs.16/-",{"v":16,"d":"16.00"},{"v":0.02960222016651249,"d":"2.96%"},"Successful","2018-08-07",{"$nulls":3},"R"]
[3,"2018-08-02",null,"CHOLAFIN","Buy","1445-1455",1378,null,"1550-1580","Open",{"$nulls":4},{"$f":"VLOOKUP(D12,Sheet2!$A$1:M2182,6,0)","v":1443.55},null,null,"H"]
[4,"2018-08-02",null,"PETRONET","Buy","230-232",218,null,"250-255","Open",{"$nulls":4},{"$f":"VLOOKUP(D13,Sheet2!$A$1:M2183,6,0)","v":229.7},null,null,"H"]
[5,"2018-08-03",null,"MARICO","Buy",351.5,337,361.5,"373-376","Part Profit of Rs.10/-",{"$f":"H14-F14","v":{"v":10,"d":"10.00"}},{"$f":"K14/F14","v":{"v":0.02844950213371266,"d":"2.84%"}},"Successful","2018-08-06",{"$nulls":3},"R"]
[6,"2018-08-06",null,"JYOTHYLAB","Buy","224-226",213.7,null,"245-250","Open",{"$nulls":4},{"$f":"VLOOKUP(D15,Sheet2!$A$1:M2185,6,0)","v":219.4},null,null,"R"]
[7,"2018-08-07",null,"PEL","Buy",2830,2693,2920,"3090-3110","Part Profit of Rs.90/-",{"$f":"H16-F16","v":{"v":90,"d":"90.00"}},{"$f":"K16/F16","v":{"v":0.03180212014134275,"d":"3.18%"}},"Successful","2018-08-07",{"$nulls":3},"R"]
[8,"2018-08-09",null,"SIEMENS","Buy","990-1000",945,null,"1085-1095","Open",{"$nulls":4},{"$f":"VLOOKUP(D17,Sheet2!$A$1:M2187,6,0)","v":1005.3},null,null,"R"]
[9,"2018-08-09",null,"BRITANNIA","Buy","6320-6340",6080,null,"6750-6800","Open",{"$nulls":4},{"$f":"VLOOKUP(D18,Sheet2!$A$1:M2188,6,0)","v":6335.4},null,null,"R"]
[10,"2018-08-09",null,"TATAMOTORS","Buy","257-259",246,null,"282-286","Open",{"$nulls":4},{"$f":"VLOOKUP(D19,Sheet2!$A$1:M2189,6,0)","v":257.85},null,null,"R"]
[11,"2018-08-09",null,"AXISBANK","Sell","615-619",645,null,"580-570","Open",{"$nulls":4},{"$f":"VLOOKUP(D20,Sheet2!$A$1:M2190,6,0)","v":621.05},null,null,"H"]
{"$rows_left_out":212}
{"sheet":"Sheet2","index":6,"n_rows":1653,"n_cols":14,"rows_kept":1653,"hidden":true}
["SYMBOL","SERIES","OPEN","HIGH","LOW","CLOSE","LAST","PREVCLOSE","TOTTRDQTY","TOTTRDVAL","TIMESTAMP","TOTALTRADES","ISIN","ISIN"]
["20MICRONS","EQ",50.3,50.5,46.3,47.3,47.25,49.3,376068,18253539.75,"2018-08-09",3064,"INE144J01027"]
["21STCENMGM","EQ",40,40.95,39.4,39.4,39.4,40.2,5102,201574.9,"2018-08-09",66,"INE253B01015"]
["3IINFOTECH","EQ",3.7,3.7,3.6,3.7,3.7,3.65,2114402,7732371.1,"2018-08-09",673,"INE748C01020"]
["3MINDIA","EQ",23880,24520,23723.15,24147.8,23999.95,23898.35,8561,206743326.25,"2018-08-09",1020,"INE470A01017"]
["3PLAND","BE",12.8,14.05,12.8,14.05,14.05,13.4,924,12098.45,"2018-08-09",6,"INE105C01023"]
["5PAISA","EQ",415,415,354.15,377.65,378,393.45,6388,2473160.3,"2018-08-09",333,"INE618L01018"]
["63MOONS","EQ",74.7,76.9,73.6,74.65,74.35,74,234268,17662482.1,"2018-08-09",3020,"INE111B01023"]
["8KMILES","EQ",392.5,392.5,365.55,372.5,372.5,374.05,482264,184134484.35,"2018-08-09",12852,"INE650K01021"]
["A2ZINFRA","EQ",22.65,23.4,22.65,23.05,23.2,22.65,309914,7138222.15,"2018-08-09",1096,"INE619I01012"]
["AARTIDRUGS","EQ",554.8,563,551.1,555.2,556,553.6,41632,23218769.5,"2018-08-09",810,"INE767A01016"]
["AARTIIND","EQ",1395,1445,1395,1437.55,1433,1397.85,93893,134391463.55,"2018-08-09",5346,"INE769A01020"]
["AARVEEDEN","EQ",34.4,34.85,33.75,34.35,34.5,34.6,2127,72943.2,"2018-08-09",69,"INE273D01019"]
["ABAN","EQ",117.5,119.85,116.3,117.15,117.05,117.55,892775,105220156.45,"2018-08-09",9371,"INE421A01028"]
["ABB","EQ",1221.9,1221.9,1192,1200.3,1204.8,1212.7,26813,32372595.85,"2018-08-09",1897,"INE117A01022"]
["ABBOTINDIA","EQ",8000,8088,7825.1,7919.3,7841.05,8042.35,8591,68666485.85,"2018-08-09",1524,"INE358A01014"]
["ABCAPITAL","EQ",149.35,152.4,149.05,150.1,149.9,149.3,1779312,268148671.3,"2018-08-09",14888,"INE674K01013"]
["ABFRL","EQ",179.2,184,175.1,181.9,183.25,179.15,1670435,300143000.05,"2018-08-09",13785,"INE647O01011"]
["ABMINTLTD","BE",20.55,20.6,19.6,19.6,19.6,20.6,160,3233.5,"2018-08-09",4,"INE251C01017"]
["ACC","EQ",1538.1,1577,1538.1,1570.75,1575.3,1536.3,691430,1082512850.15,"2018-08-09",20794,"INE012A01025"]
{"$rows_left_out":1633}