{"text_format":"3","workbook":"xlsx","n_sheets":9,"sheets":["Main","Future Intra","Cash Intra","MidCap Intra","Bulk Deals","Call Tracker (Equity & F&O)","Sheet2","Sheet1","Sheet3"],"not_rendered":{"images":4,"defined_names":4},"read":"whole","date_system":"1900"}

{"sheet":"Main","index":0,"n_rows":17,"n_cols":4,"rows_kept":17}
[null,"                                                                                                 "]
{"$rows_empty":8}
[null,"2019-02-04"]
[]
[null,"Sheet No.","Template Name","Summary"]
[null,1,"Future Intra","For Intraday trading in F&O segment"]
[null,2,"Cash Intra","For Intraday trading in cash market segment"]
[null,3,"Mid-cap Intra","For Intraday trading in Mid-cap stocks"]
[null,4,"Bulk Deals","Reveals Bulk Deals carried on NSE & BSE"]
[null,5,"Call Tracker"]

{"sheet":"Future Intra","index":1,"n_rows":239,"n_cols":15,"rows_kept":239,"merged":[[8,0,9,0],[8,1,9,1],[8,2,9,2],[8,5,8,7],[8,8,8,10]]}
[]
[]
[]
[]
[{"$nulls":12},"Back to Main Page"]
["FOR INTRA DAY TRADING",{"$nulls":10},{"$f":"Main!B10","v":"2019-02-04"}]
[]
[]
["Sr.no","Sector","Scrip","CLOSE RATE","Pivot Point","Supports",null,null,"Resistances"]
[null,"Sector",null,"Point","Point","S1","S2","S3","R1","R2","R3","HIGH","LOW","OI","% Change in OI"]
[1,"Index","BANKNIFTY",27144.65,{"v":27231.533333333336,"d":"27231.53"},{"v":26863.116666666672,"d":"26863.12"},{"v":26581.583333333336,"d":"26581.58"},{"v":26213.16666666667,"d":"26213.17"},{"v":27513.066666666673,"d":"27513.07"},{"v":27881.483333333337,"d":"27881.48"},{"v":28163.016666666674,"d":"28163.02"},27599.95,26950,1447060,{"v":2.2162813569182606E-3,"d":"0.22%"}]
[2,"Index","NIFTY",10914.05,{"v":10924.116666666667,"d":"10924.12"},{"v":10825.033333333333,"d":"10825.03"},{"v":10736.016666666666,"d":"10736.02"},{"v":10636.933333333332,"d":"10636.93"},{"v":11013.133333333333,"d":"11013.13"},{"v":11112.216666666665,"d":"11112.22"},{"v":11201.233333333334,"d":"11201.23"},11023.2,10835.1,19530075,{"v":0.04485139814543602,"d":"4.49%"}]
[3,"Index","NIFTYIT",{"v":15784,"d":"15784.00"},{"v":15717,"d":"15717.00"},{"v":15624,"d":"15624.00"},{"v":15464,"d":"15464.00"},{"v":15371,"d":"15371.00"},{"v":15877,"d":"15877.00"},{"v":15970,"d":"15970.00"},{"v":16130,"d":"16130.00"},15810,15557,29800,{"v":0.3607305936073059,"d":"36.07%"}]
[4,"Cement","ACC",{"v":1422.8,"d":"1422.80"},{"v":1429,"d":"1429.00"},1402.15,{"v":1381.5,"d":"1381.50"},1354.65,1449.65,{"v":1476.5,"d":"1476.50"},1497.15,1455.85,1408.35,1554800,{"v":0.03874933190807055,"d":"3.87%"}]
[5,"Others","ADANIENT",{"v":142.8,"d":"142.80"},140.85,{"v":137.1,"d":"137.10"},{"v":131.4,"d":"131.40"},127.65,{"v":146.54999999999998,"d":"146.55"},{"v":150.29999999999998,"d":"150.30"},{"v":155.99999999999997,"d":"156.00"},144.6,135.15,40944000,{"v":0.021454944616305757,"d":"2.15%"}]
[6,"Others","ADANIPORTS",340.75,341.75,{"v":334.5,"d":"334.50"},328.25,{"v":321,"d":"321.00"},{"v":348,"d":"348.00"},355.25,{"v":361.5,"d":"361.50"},349,335.5,22522500,{"v":-0.014763779527559055,"d":"-1.48%"}]
[7,"Power","ADANIPOWER",{"v":44.3,"d":"44.30"},{"v":44.36666666666667,"d":"44.37"},{"v":41.68333333333334,"d":"41.68"},{"v":39.06666666666667,"d":"39.07"},{"v":36.38333333333334,"d":"36.38"},{"v":46.983333333333334,"d":"46.98"},{"v":49.66666666666666,"d":"49.67"},{"v":52.28333333333333,"d":"52.28"},47.05,41.75,153460000,{"v":0.016964877402253147,"d":"1.70%"}]
[8,"Pharma","AJANTPHARM",{"v":983,"d":"983.00"},{"v":995.8833333333333,"d":"995.88"},{"v":958.5666666666666,"d":"958.57"},{"v":934.1333333333333,"d":"934.13"},{"v":896.8166666666666,"d":"896.82"},{"v":1020.3166666666666,"d":"1020.32"},{"v":1057.6333333333334,"d":"1057.63"},{"v":1082.0666666666666,"d":"1082.07"},1033.2,971.45,715000,{"v":0.09746738296239447,"d":"9.75%"}]
[9,"Banking","ALBK",43.55,{"v":44,"d":"44.00"},42.35,41.15,{"v":39.5,"d":"39.50"},{"v":45.2,"d":"45.20"},{"v":46.85000000000001,"d":"46.85"},{"v":48.050000000000004,"d":"48.05"},45.65,42.8,17797000,{"v":0.08135860979462875,"d":"8.14%"}]
[10,"Automobile","AMARAJABAT",{"v":762.7,"d":"762.70"},{"v":757.9166666666666,"d":"757.92"},{"v":750.8333333333333,"d":"750.83"},{"v":738.9666666666666,"d":"738.97"},{"v":731.8833333333332,"d":"731.88"},{"v":769.7833333333333,"d":"769.78"},{"v":776.8666666666666,"d":"776.87"},{"v":788.7333333333333,"d":"788.73"},765,746.05,966700,{"v":0.026765799256505577,"d":"2.68%"}]
{"$rows_left_out":210}
{"sheet":"Cash Intra","index":2,"n_rows":247,"n_cols":13,"rows_kept":247,"merged":[[7,0,8,0],[7,1,8,1],[7,2,8,2],[7,3,8,3],[7,4,7,6],[7,7,7,9]]}
[]
[]
[]
[]
[{"$nulls":12},"Back to Main Page"]
["FOR INTRA DAY TRADING",{"$nulls":9},{"$f":"Main!B10","v":"2019-02-04"}]
[]
["Sr.no","Scrip","CLOSE RATE","Pivot Point","Supports",null,null,"Resistances"]
[null,null,"Point",null,"S1","S2","S3","R1","R2","R3","HIGH","LOW","Total Trade Quanity in Lakhs"]
[1,"Nifty 50",10893.65,10896.85,10810.25,10726.85,10640.25,10980.25,{"v":11066.850000000002,"d":"11066.85"},11150.25,10983.45,10813.45]
[2,"Nifty Bank",27085.95,{"v":27183.149999999998,"d":"27183.15"},{"v":26833.249999999996,"d":"26833.25"},26580.55,{"v":26230.649999999998,"d":"26230.65"},{"v":27435.849999999995,"d":"27435.85"},{"v":27785.749999999996,"d":"27785.75"},{"v":28038.449999999993,"d":"28038.45"},27533.05,26930.45]
[3,"Nifty CPSE",1981.8,{"v":1980.9166666666667,"d":"1980.92"},{"v":1969.4833333333336,"d":"1969.48"},{"v":1957.1666666666667,"d":"1957.17"},{"v":1945.7333333333336,"d":"1945.73"},{"v":1993.2333333333336,"d":"1993.23"},{"v":2004.6666666666665,"d":"2004.67"},{"v":2016.9833333333336,"d":"2016.98"},1992.35,1968.6]
[4,"Nifty Infra",2997.95,{"v":2997,"d":"2997.00"},{"v":2980.7,"d":"2980.70"},2963.45,{"v":2947.1499999999996,"d":"2947.15"},3014.25,3030.55,{"v":3047.8,"d":"3047.80"},3013.3,2979.75]
[5,"Nifty IT",15724.3,{"v":15653.916666666666,"d":"15653.92"},{"v":15556.083333333332,"d":"15556.08"},{"v":15387.866666666667,"d":"15387.87"},{"v":15290.033333333333,"d":"15290.03"},{"v":15822.133333333331,"d":"15822.13"},{"v":15919.966666666664,"d":"15919.97"},{"v":16088.18333333333,"d":"16088.18"},15751.75,15485.7]
[6,"Nifty PSE",3213.5,3209.85,3194.85,{"v":3176.2,"d":"3176.20"},{"v":3161.2,"d":"3161.20"},{"v":3228.5,"d":"3228.50"},{"v":3243.5,"d":"3243.50"},3262.15,3224.85,3191.2]
[7,"Nifty Midcap 50",4719.85,{"v":4716.466666666667,"d":"4716.47"},{"v":4668.833333333334,"d":"4668.83"},{"v":4617.816666666667,"d":"4617.82"},{"v":4570.183333333333,"d":"4570.18"},{"v":4767.4833333333345,"d":"4767.48"},{"v":4815.116666666668,"d":"4815.12"},{"v":4866.133333333335,"d":"4866.13"},4764.1,4665.45]
[8,"ABB",1272.2,{"v":1276.0666666666666,"d":"1276.07"},{"v":1257.1333333333332,"d":"1257.13"},{"v":1242.0666666666666,"d":"1242.07"},{"v":1223.1333333333332,"d":"1223.13"},{"v":1291.1333333333332,"d":"1291.13"},{"v":1310.0666666666666,"d":"1310.07"},{"v":1325.1333333333332,"d":"1325.13"},1295,1261,0.97864]
[9,"ACC",1415.55,{"v":1421.6000000000001,"d":"1421.60"},{"v":1395.2000000000003,"d":"1395.20"},{"v":1374.8500000000001,"d":"1374.85"},{"v":1348.4500000000003,"d":"1348.45"},{"v":1441.9500000000003,"d":"1441.95"},{"v":1468.3500000000004,"d":"1468.35"},{"v":1488.7000000000003,"d":"1488.70"},1448,1401.25,5.68663]
[10,"AIAENG",1599.85,{"v":1611.1833333333334,"d":"1611.18"},{"v":1579.3666666666668,"d":"1579.37"},{"v":1558.8833333333334,"d":"1558.88"},{"v":1527.0666666666668,"d":"1527.07"},{"v":1631.6666666666667,"d":"1631.67"},{"v":1663.4833333333333,"d":"1663.48"},{"v":1683.9666666666667,"d":"1683.97"},1643,1590.7,0.11876]
[11,"AUBANK",579.55,{"v":583.1166666666667,"d":"583.12"},{"v":572.4333333333334,"d":"572.43"},{"v":565.3166666666667,"d":"565.32"},{"v":554.6333333333334,"d":"554.63"},{"v":590.2333333333333,"d":"590.23"},{"v":600.9166666666665,"d":"600.92"},{"v":608.0333333333333,"d":"608.03"},593.8,576,2.63192]
{"$rows_left_out":228}
{"sheet":"MidCap Intra","index":3,"n_rows":510,"n_cols":13,"rows_kept":510,"merged":[[0,0,0,1],[8,0,9,0],[8,1,9,1],[8,2,9,2],[8,3,9,3],[8,4,8,6],[8,7,8,9]]}
[]
[]
[]
[]
[{"$nulls":11},"Back To Main Page"]
["FOR INTRA DAY TRADING",{"$nulls":9},{"$f":"Main!B10","v":"2019-02-04"}]
[null,null," "]
[]
["Sr.no","Scrip","CLOSE RATE","Pivot Point","Supports",null,null,"Resistances"]
[null,null,"Point",null,"S1","S2","S3","R1","R2","R3","HIGH","LOW","Total Trade Quanity in Lakhs"]
[1,"3MINDIA",20293.5,{"v":20347.833333333332,"d":"20347.83"},{"v":20105.666666666664,"d":"20105.67"},{"v":19917.833333333332,"d":"19917.83"},{"v":19675.666666666664,"d":"19675.67"},{"v":20535.666666666664,"d":"20535.67"},{"v":20777.83333333333,"d":"20777.83"},{"v":20965.666666666664,"d":"20965.67"},20590,20160,0.0127]
[2,"8KMILES",121,{"v":124.43333333333334,"d":"124.43"},{"v":116.56666666666666,"d":"116.57"},{"v":112.13333333333333,"d":"112.13"},{"v":104.26666666666665,"d":"104.27"},{"v":128.86666666666667,"d":"128.87"},{"v":136.73333333333335,"d":"136.73"},{"v":141.16666666666669,"d":"141.17"},132.3,120,5.52825]
[3,"AARTIIND",1632.35,{"v":1635.7,"d":"1635.70"},{"v":1616.4,"d":"1616.40"},1600.45,1581.15,1651.65,{"v":1670.9499999999998,"d":"1670.95"},{"v":1686.9,"d":"1686.90"},1655,1619.75,0.37009]
[4,"ABAN",66.5,{"v":66.61666666666666,"d":"66.62"},{"v":64.98333333333332,"d":"64.98"},{"v":63.466666666666654,"d":"63.47"},{"v":61.833333333333314,"d":"61.83"},{"v":68.13333333333333,"d":"68.13"},{"v":69.76666666666668,"d":"69.77"},{"v":71.28333333333333,"d":"71.28"},68.25,65.1,3.21734]
[5,"ABB",1272.2,{"v":1276.0666666666666,"d":"1276.07"},{"v":1257.1333333333332,"d":"1257.13"},{"v":1242.0666666666666,"d":"1242.07"},{"v":1223.1333333333332,"d":"1223.13"},{"v":1291.1333333333332,"d":"1291.13"},{"v":1310.0666666666666,"d":"1310.07"},{"v":1325.1333333333332,"d":"1325.13"},1295,1261,0.97864]
[6,"ABCAPITAL",80.5,{"v":80.38333333333333,"d":"80.38"},{"v":79.31666666666665,"d":"79.32"},{"v":78.13333333333333,"d":"78.13"},{"v":77.06666666666665,"d":"77.07"},{"v":81.56666666666665,"d":"81.57"},{"v":82.63333333333331,"d":"82.63"},{"v":83.81666666666665,"d":"83.82"},81.45,79.2,55.45273]
[7,"ABFRL",208.95,{"v":210.33333333333334,"d":"210.33"},{"v":206.16666666666669,"d":"206.17"},{"v":203.38333333333335,"d":"203.38"},{"v":199.2166666666667,"d":"199.22"},{"v":213.11666666666667,"d":"213.12"},{"v":217.28333333333336,"d":"217.28"},{"v":220.06666666666666,"d":"220.07"},214.5,207.55,6.59499]
[8,"ACC",1415.55,{"v":1421.6000000000001,"d":"1421.60"},{"v":1395.2000000000003,"d":"1395.20"},{"v":1374.8500000000001,"d":"1374.85"},{"v":1348.4500000000003,"d":"1348.45"},{"v":1441.9500000000003,"d":"1441.95"},{"v":1468.3500000000004,"d":"1468.35"},{"v":1488.7000000000003,"d":"1488.70"},1448,1401.25,5.68663]
[9,"ADANIPORTS",338.45,{"v":339.53333333333336,"d":"339.53"},{"v":332.2666666666667,"d":"332.27"},{"v":326.08333333333337,"d":"326.08"},{"v":318.8166666666667,"d":"318.82"},{"v":345.7166666666667,"d":"345.72"},{"v":352.98333333333335,"d":"352.98"},{"v":359.1666666666667,"d":"359.17"},346.8,333.35,31.19675]
[10,"ADANIPOWER",44.2,{"v":44.300000000000004,"d":"44.30"},{"v":41.75000000000001,"d":"41.75"},{"v":39.300000000000004,"d":"39.30"},{"v":36.75000000000001,"d":"36.75"},{"v":46.75000000000001,"d":"46.75"},{"v":49.300000000000004,"d":"49.30"},{"v":51.75000000000001,"d":"51.75"},46.85,41.85,110.3352]
{"$rows_left_out":491}
{"sheet":"Bulk Deals","index":4,"n_rows":89,"n_cols":8,"rows_kept":89,"merged":[[4,0,4,1],[4,2,4,3],[6,1,6,2]]}
[" "]
[]
[]
[]
[]
[{"$nulls":4},"Back To Main Page"]
["Subject :","BULK DEAL",null,{"$f":"Main!B10","v":"2019-02-04"}]
[]
["Date","Scrip code","Scrip Name","Client Name","Buy / Sell","Quantity Traded","Trade Price / Wt.Avg.trade price","Exchange  "]
["2019-02-01",537766,"BCP","DIPESH SITARAM GORULE","BUY",{"v":282417,"d":"282,417"},41.01,"BSE"]
["2019-02-01",537766,"BCP","DIPESH SITARAM GORULE","SELL",{"v":432417,"d":"432,417"},40.49,"BSE"]
["2019-02-01",511710,"CUBIFIN","KANCHENJUNGA ADVERTISING P LTD","SELL",500000,1.05,"BSE"]
["2019-02-01",511710,"CUBIFIN","ASHWANI KUMAR GUPTA","BUY",499900,1.05,"BSE"]
["2019-02-01",539009,"GBLIL","RAKHIBEN PARESHBHAI PATEL","SELL",70000,80.2,"BSE"]
["2019-02-01",526717,"GOPALA","JYOTIKA DEEPAK SHENOY","BUY",74000,74.85,"BSE"]
["2019-02-01",526717,"GOPALA","ASPIRE EMERGING FUND","SELL",81200,75.89,"BSE"]
["2019-02-01",506640,"GUJCMDS","MARISHA HARDIK MOTTA","BUY",3034,104,"BSE"]
["2019-02-01",506640,"GUJCMDS","VISHWAMURTE TRAD INVEST PE LTD","SELL",2634,104,"BSE"]
["2019-02-01",526967,"HEERAISP","KEENA MILAN KOTHARI","SELL",50000,1.92,"BSE"]
["2019-02-01",526967,"HEERAISP","SANGEETA SULTANIA","BUY",45000,1.91,"BSE"]
{"$rows_left_out":70}
{"sheet":"Call Tracker (Equity & F&O)","index":5,"n_rows":391,"n_cols":18,"rows_kept":391,"merged":[[41,0,42,0],[41,1,42,1],[41,2,42,2],[41,9,42,9],[41,11,42,11],[41,12,42,12],[41,13,42,13],[41,14,42,14]]}
[]
[]
[]
[]
[{"$nulls":12},"Back To Main Page"]
["Retail Research Technical Calls & Fundamental Performance Report for the month of February -2019 "]
[{"$nulls":12},{"$f":"Main!B10","v":"2019-02-04"}]
[null,"Positional  Call"]
["Sr.no","Date",null,"Company","Rec","Rec Price","Stop Loss***","Call Closed At","Target","Remark","Profit / Loss per Share","Gain / Loss  %","Status","Closed Date","NSE Closed Price"]
[1,"2019-01-24",null,"ITC","Buy","279-281",268,null,305,"Open",{"$nulls":4},{"$f":"VLOOKUP(D10,Sheet2!A10:M1505,6,0)","v":280.85},null,null,"R"]
[2,"2019-01-25",null,"UBL","Sell",1435,1510,1392.5,"1300-1280","Part Profit of Rs.42.50/-",{"$f":"F11-H11","v":42.5},{"$f":"K11/F11","v":{"v":0.029616724738675958,"d":"2.96%"}},"Successful","2019-01-28",{"$nulls":3},"H"]
[3,"2019-01-29",null,"MARUTI","Buy",6575,6290,6910,"7000-7100","Profit of Rs.335/-",{"$f":"H12-F12","v":335},{"v":0.05095057034220532,"d":"5.10%"},"Successful","2019-02-01",{"$nulls":3},"R"]
[4,"2019-01-30",null,"ULTRACEMCO","Buy",3400,3230,3510,"3750-3800","Part Profit of Rs.110/-",110,{"$f":"K13/F13","v":{"v":0.03235294117647059,"d":"3.24%"}},"Successful","2019-01-31",{"$nulls":3},"H"]
{"$rows_empty":9}
["CLBS = Closing Basis ***",{"$nulls":4},"Reinitiated $"]
["Dividend adjusted <>",{"$nulls":4},"Revised stoploss #"]
["Part book {}"]
["Master Trade High Risk"]
["Sr.no","Date",null,"Company","Rec","Rec Price","Stop Loss","Call Closed At","Target","Remark","Profit / Loss per share","Gain / Loss  per Lot","Lot","Status","Closed Date"]
[1,"2019-02-01",null,"NIFTY FEB FUT","Sell",10955,10860,10885,10800,"Profit of Rs.70/-",{"$f":"F28-H28","v":70},{"$f":"M28*K28","v":5250},75,"Successful","2019-02-02",null,null,"R"]
{"$rows_left_out":197}
{"sheet":"Sheet2","index":6,"n_rows":1631,"n_cols":14,"rows_kept":1631,"hidden":true}
["SYMBOL","SERIES","OPEN","HIGH","LOW","CLOSE","LAST","PREVCLOSE","TOTTRDQTY","TOTTRDVAL","TIMESTAMP","TOTALTRADES","ISIN","ISIN"]
["20MICRONS","EQ",37.9,38.9,36.75,38,38,37.05,21920,832731.8,"2019-02-01",282,"INE144J01027"]
["21STCENMGM","EQ",21.3,21.3,21.15,21.15,21.15,21.55,1369,28955.85,"2019-02-01",16,"INE253B01015"]
["3IINFOTECH","EQ",3.35,3.35,3.25,3.3,3.35,3.35,1654995,5481208.05,"2019-02-01",654,"INE748C01020"]
["3MINDIA","EQ",20160,20590,20160,20293.5,20300,20151.6,1270,25827761.6,"2019-02-01",334,"INE470A01017"]
["3PLAND","EQ",11.2,12.1,10.3,11.5,11.5,10.5,861,9804.35,"2019-02-01",19,"INE105C01023"]
["5PAISA","EQ",242.75,247.7,235.3,236.35,235.3,242.75,2543,609448.2,"2019-02-01",256,"INE618L01018"]
["63MOONS","EQ",89.75,89.75,84.3,84.95,84.6,88.35,170269,14739470.9,"2019-02-01",3964,"INE111B01023"]
["8KMILES","EQ",132.3,132.3,120,121,120.7,126,552825,69307915.7,"2019-02-01",6397,"INE650K01021"]
["A2ZINFRA","EQ",10.75,10.85,10.55,10.85,10.85,10.35,118565,1280835.5,"2019-02-01",322,"INE619I01012"]
["AARTIDRUGS","EQ",589.6,605,586.05,594.5,595,588.95,11255,6719532.7,"2019-02-01",802,"INE767A01016"]
["AARTIIND","EQ",1620,1655,1619.75,1632.35,1644,1625.65,37009,60678215.4,"2019-02-01",9157,"INE769A01020"]
["AARVEEDEN","EQ",23.85,24.4,23.15,23.2,23.45,23.5,2502,58720.3,"2019-02-01",74,"INE273D01019"]
["AAVAS","EQ",858.25,858.25,811,838.4,820.95,853.85,20406,17168462.95,"2019-02-01",904,"INE216P01012"]
["ABAN","EQ",67.1,68.25,65.1,66.5,66.3,67.15,321734,21439921.55,"2019-02-01",3434,"INE421A01028"]
["ABB","EQ",1290,1295,1261,1272.2,1270,1272.3,97864,125313756.1,"2019-02-01",5935,"INE117A01022"]
["ABBOTINDIA","EQ",8120,8193.15,8035.3,8098.9,8080.1,8070.1,2057,16681303.85,"2019-02-01",642,"INE358A01014"]
["ABCAPITAL","EQ",81.1,81.45,79.2,80.5,80.65,81,5545273,443818815.55,"2019-02-01",22006,"INE674K01013"]
["ABFRL","EQ",209.5,214.5,207.55,208.95,208.85,209.5,659499,139099303.1,"2019-02-01",10344,"INE647O01011"]
["ABSLNN50ET","EQ",285.8,285.8,285.8,285.8,285.8,287.33,6,1714.8,"2019-02-01",1,"INF209KB1B87"]
{"$rows_left_out":1612}
{"sheet":"Sheet1","index":7,"n_rows":0,"n_cols":0,"rows_kept":0,"hidden":true}

{"sheet":"Sheet3","index":8,"n_rows":0,"n_cols":0,"rows_kept":0,"hidden":true}